Fix deprecated expat 2.1.0

7 jobs for fix_depends_boost_location in 11 minutes and 42 seconds (queued for 7 seconds)
latest
Status Name Job ID Coverage
  Build
canceled Linux32-snapshot #8802
linux32

failed Linux64-snapshot #8801
linux64

00:11:39

canceled Osx-dmg-snapshot #8805
osx

canceled Osx-snapshot #8804
osx

00:01:24

canceled RaspberryPi-snapshot #8803
raspi

00:01:22

failed Win32-snapshot #8800
windows

00:00:13

failed Win64-snapshot #8799
windows

00:00:19

 
Name Stage Failure
failed
Linux64-snapshot Build
make[3]: Leaving directory '/home/gitlab-runner/builds/i6yoZWXb/0/crown/crown-core/depends/work/build/x86_64-unknown-linux-gnu/fontconfig/2.11.1-f707eed99d1/src'
make[2]: *** [Makefile:561: all-recursive] Error 1
make[2]: Leaving directory '/home/gitlab-runner/builds/i6yoZWXb/0/crown/crown-core/depends/work/build/x86_64-unknown-linux-gnu/fontconfig/2.11.1-f707eed99d1'
make[1]: *** [Makefile:444: all] Error 2
make[1]: Leaving directory '/home/gitlab-runner/builds/i6yoZWXb/0/crown/crown-core/depends/work/build/x86_64-unknown-linux-gnu/fontconfig/2.11.1-f707eed99d1'
make: *** [funcs.mk:233: /home/gitlab-runner/builds/i6yoZWXb/0/crown/crown-core/depends/work/build/x86_64-unknown-linux-gnu/fontconfig/2.11.1-f707eed99d1/./.stamp_built] Error 2
make: Leaving directory '/home/gitlab-runner/builds/i6yoZWXb/0/crown/crown-core/depends'
Cleaning up file based variables
ERROR: Job failed: exit status 1
failed
Win32-snapshot Build
Running on runner...
Getting source from Git repository
Fetching changes...
Initialized empty Git repository in /home/gitlab-runner/builds/7io_82oh/0/crown/crown-core/.git/
Created fresh repository.
fatal: write error: No space left on device
fatal: index-pack failed
Cleaning up file based variables
ERROR: Job failed: exit status 1
failed
Win64-snapshot Build
Running on runner...
Getting source from Git repository
Fetching changes...
Initialized empty Git repository in /home/gitlab-runner/builds/7io_82oh/0/crown/crown-core/.git/
Created fresh repository.
fatal: write error: No space left on device
fatal: index-pack failed
Cleaning up file based variables
ERROR: Job failed: exit status 1